class
type: ObjectProperty
comment: The restricted object has this rdf:type.
range: Resource
domain: Resource

value
type: ObjectProperty
comment: Specifies a constraint on the datatype of the literal(s) to select.
range: Resource
domain: Selector

display
type: ObjectProperty
comment: Relates a resource to its display.
range: Display Style
domain: Selector

font weight
type: ObjectProperty
comment: The weight of font to use.
range: string
type: DatatypeProperty
domain: Style Set

icon
type: ObjectProperty
comment: Replace a resource with a bitmap icon if possible.
range: Resource
domain: Style Set

layout
type: ObjectProperty
comment: Specifies which layout statements with this subject will have
range: Layout Form
domain: Selector

object
type: ObjectProperty
comment: A restriction on the object of a statement (range is either an object or a literal).
domain: Statement

object Of Statement
type: ObjectProperty
comment: The subject of this property will be selected because it is the object of a statement.
domain: Selector
range: Statement

predicate
type: ObjectProperty
comment: A restriction on the predicate of a statement.
range: Resource
domain: Statement

object Of Statement
type: ObjectProperty
comment: The subject of this property will be selected because it is the property of a statement.
domain: Property
range: Statement

shape
type: ObjectProperty
comment: Shape of a resource's representation.
range: Polygon
domain: Style Set

sort Properties By
type: ObjectProperty
comment: Describes how to sort a table based on property names.
domain: Resource
range: Sort Property

style
type: ObjectProperty
comment: Relating a resource to its style.
domain: Selector
range: Style Set

subject
type: ObjectProperty
comment: A restriction on the subject of a statement.
range: Resource
domain: Statement

subject Of Statement
type: ObjectProperty
comment: The subject of this property will be selected because it is the subject of a statement.
domain: Resource
range: Statement

text align
type: ObjectProperty
comment: Relating a resource to its label placement.
range: Alignment
domain: Style Set

uri Equals
type: ObjectProperty
comment: Describes which URI a selected resource should be equal to.
range: Resource
domain: Selector

uri Starts With
type: ObjectProperty
comment: Describes what URI fragment a selected resource should begin with.
range: Resource
domain: Selector

visibility
type: ObjectProperty
comment: A resource's visibility; it is still part of the layout calculation, but may not actually be displayed.
domain: Selector
range: Visibility Style

fill
type: DatatypeProperty
comment: Color for filling in the polygon.
domain: Style Set
range: string

font family
type: DatatypeProperty
comment: The type of font to use.
domain: Style Set
range: string

font size
type: DatatypeProperty
comment: The size of font to use.
domain: Style Set
range: string

font style
type: DatatypeProperty
comment: The style (italic or not) of font to use.
domain: Style Set
range: string

stroke
type: DatatypeProperty
comment: Color of the polygon's border.
domain: Style Set
range: string

stroke dasharray
type: DatatypeProperty
comment: Discontinuous line, a comma-separated list of floats
domain: Style Set
range: string

stroke width
type: DatatypeProperty
comment: Width of the polygon's border.
domain: Style Set
range: double

value
type: DatatypeProperty
comment: Specifies an equality constraint on the value of the literal(s) to select.
range: Literal
domain: Selector

Alignment
type: Class
equivalent class: Class
  one of: Below
  one of: Left
  one of: Right
  one of: Above
  one of: Center
comment: Various alignments of text.

Circle
comment: Circle shape
type: Thing
type: Polygon
type: NamedIndividual

Diamond
comment: Diamond shape
type: Thing
type: Polygon
type: NamedIndividual

Display Style
type: Class
equivalent class: Class
  one of: None
comment: Controls displaying of a resource.

Ellipse
comment: Ellipse shape
type: Thing
type: Polygon
type: NamedIndividual

Layout Form
type: Class
equivalent class: Class
  one of: Node And Arc
  one of: Table
comment: A structure for laying out a graph.

Literal
type: Class
subclass of: Selector
subclass of: Restriction
  on property: value
  min cardinality: 0
subclass of: Restriction
  on property: style
  min cardinality: 0
subclass of: Restriction
  on property: visibility
  min cardinality: 0
subclass of: Restriction
  on property: sort Properties By
  min cardinality: 0
subclass of: Restriction
  on property: value
  min cardinality: 0
subclass of: Restriction
  on property: object Of Statement
  min cardinality: 0
subclass of: Restriction
  on property: layout
  min cardinality: 0
subclass of: Restriction
  on property: display
  min cardinality: 0
comment: A generic, untyped literal, used as a selector.

Octagon
comment: Octagon shape
type: Thing
type: Polygon
type: NamedIndividual

Plain Literals
type: Class
subclass of: Resource
comment: Special class denoting untyped literals, can be usedas the object of gss:datatype.

Polygon
type: Class
equivalent class: Class
  union of: Circle
  union of: Diamond
  union of: Ellipse
  union of: Octagon
  union of: Rectangle
  union of: Round Rectangle
  union of: Triangle East
  union of: Triangle North
  union of: Triangle South
  union of: Triangle West
  union of: string
comment: Shape given to represent a resource.

Property
type: Class
subclass of: Selector
subclass of: Restriction
  on property: visibility
  min cardinality: 0
subclass of: Restriction
  on property: sort Properties By
  min cardinality: 0
subclass of: Restriction
  on property: layout
  min cardinality: 0
subclass of: Restriction
  on property: style
  min cardinality: 0
subclass of: Restriction
  on property: display
  min cardinality: 0
subclass of: Restriction
  on property: uri Starts With
  min cardinality: 0
subclass of: Restriction
  on property: object Of Statement
  min cardinality: 0
subclass of: Restriction
  on property: uri Equals
  min cardinality: 0
comment: A generic RDF property, used as a selector.

Rectangle
comment: Rectangle shape
type: Thing
type: Polygon
type: NamedIndividual

Resource
type: Class
subclass of: Selector
subclass of: Restriction
  on property: layout
  min cardinality: 0
subclass of: Restriction
  on property: object Of Statement
  min cardinality: 0
subclass of: Restriction
  on property: visibility
  min cardinality: 0
subclass of: Restriction
  on property: display
  min cardinality: 0
subclass of: Restriction
  on property: style
  min cardinality: 0
subclass of: Restriction
  on property: subject Of Statement
  min cardinality: 0
subclass of: Restriction
  on property: uri Starts With
  min cardinality: 0
subclass of: Restriction
  on property: sort Properties By
  min cardinality: 0
subclass of: Restriction
  on property: uri Equals
  min cardinality: 0
comment: A generic RDF resource, used as a selector.

Round Rectangle
comment: Round Rectangle shape
type: Thing
type: Polygon
type: NamedIndividual

Selector
type: Class
equivalent class: Class
  one of: Resource
  one of: Property
  one of: Literal
comment: Selects part of a model for styling.

Sort Property
type: Class
equivalent class: Class
  one of: Name Reversed
  one of: Namespace
  one of: Name
  one of: Namespace Reversed
  one of: Seq
comment: Ways to sort a table.

Statement
type: Class
subclass of: Restriction
  on property: predicate
  min cardinality: 0
subclass of: Restriction
  on property: object
  min cardinality: 0
subclass of: Restriction
  on property: subject
  min cardinality: 0
comment: A subject-predicate-object triple.

Style Set
type: Class
subclass of: Restriction
  on property: font style
  min cardinality: 0
subclass of: Restriction
  on property: shape
  min cardinality: 0
subclass of: Restriction
  on property: font size
  min cardinality: 0
subclass of: Restriction
  on property: text align
  min cardinality: 0
subclass of: Restriction
  on property: stroke width
  min cardinality: 0
subclass of: Restriction
  on property: stroke
  min cardinality: 0
subclass of: Restriction
  on property: icon
  min cardinality: 0
subclass of: Restriction
  on property: font family
  min cardinality: 0
subclass of: Restriction
  on property: stroke dasharray
  min cardinality: 0
subclass of: Restriction
  on property: fill
  min cardinality: 0
subclass of: Restriction
  on property: font weight
  min cardinality: 0
comment: A set of styling properties.

Triangle East
comment: Equilateral triangle pointing 'east' shape
type: Thing
type: Polygon
type: NamedIndividual

Triangle North
comment: Equilateral triangle pointing 'north' shape
type: Thing
type: Polygon
type: NamedIndividual

Triangle South
comment: Equilateral triangle pointing 'south' shape
type: Thing
type: Polygon
type: NamedIndividual

Triangle West
comment: Equilateral triangle pointing 'west' shape
type: Thing
type: Polygon
type: NamedIndividual

Visibility Style
type: Class
equivalent class: Class
  one of: Hidden
  one of: Visible
comment: Hidden or visible visibility characteristic.

Seq
type: Thing
type: Sort Property
type: NamedIndividual
comment: Sorting by the order of items in the sequence.

Above
type: Thing
type: Alignment
type: NamedIndividual
comment: Position text above its representation.

Below
type: Thing
type: Alignment
type: NamedIndividual
comment: Position text below its representation.

Center
type: Thing
type: Alignment
type: NamedIndividual
comment: Position text in the center of its representation.

Fetch
type: Thing
type: NamedIndividual
comment: Specialized resource for use with gss:icon to fetch the image at the given resource's URI.

Hidden
type: Thing
type: Visibility Style
type: NamedIndividual
comment: Hidden visibility

Left
type: Thing
type: Alignment
type: NamedIndividual
comment: Position text to the left of its representation without overlapping the border.

Name
type: Thing
type: Sort Property
type: NamedIndividual
comment: Sorting by name in alphabetical order.

Name Reversed
type: Thing
type: Sort Property
type: NamedIndividual
comment: Sorting by name in reverse alphabetical order.

Namespace
type: Thing
type: Sort Property
type: NamedIndividual
comment: Sorting by namespace in alphabetical order.

Namespace Reversed
type: Thing
type: Sort Property
type: NamedIndividual
comment: Sorting order with namespaces in reverse alphabetical order.

Node And Arc
type: Thing
type: Layout Form
type: NamedIndividual
comment: Nodes and arcs representation of an RDF model, the default representation.

None
type: Thing
type: Display Style
type: NamedIndividual
comment: Displays nothing.

Right
type: Thing
type: Alignment
type: NamedIndividual
comment: Position text to the right of its representation without overlapping the border.

Table
type: Thing
type: Layout Form
type: NamedIndividual
comment: Tabular representation of an RDF model.

Visible
type: Thing
type: Visibility Style
type: NamedIndividual
comment: Visible visibility